Target
Apoptosis regulator Bcl-2
Ligand
BDBM50427829
Substrate
Meas. Tech.
ChEMBL_940709 (CHEMBL2330000)
IC50
260±n/a nM
Citation
 Aguilar, AZhou, HChen, JLiu, LBai, LMcEachern, DYang, CYMeagher, JStuckey, JWang, S A potent and highly efficacious Bcl-2/Bcl-xL inhibitor. J Med Chem 56:3048-67 (2013)  
Target
Name:
Apoptosis regulator Bcl-2
Synonyms:
Apoptosis regulator Bcl-2 Protein BCL-2 BCL2_HUMAN | Bcl-2 Protein
Type:
Homodimer or heterodimer
Mol. Mass.:
26269.11
Organism:
Homo sapiens (Human)
Description:
P10415
Residue:
239
  
Inhibitor
Name:
BDBM50427829
Synonyms:
CHEMBL2325767
Type:
Small organic molecule
Emp. Form.:
C46H49Cl2N7O4S2
Mol. Mass.:
898.962
SMILES:
CN(C)CC[C@H](CSc1ccccc1)Nc1ccc(cc1[N+]([O-])=O)S(=O)(=O)Nc1ccc(cc1)N1CCN(CC1)c1cccc(c1)-c1c(Cl)c(C)n(C)c1-c1ccc(Cl)cc1
: