Target
Steroid hormone receptor ERR1
Ligand
BDBM50427836
Substrate
Meas. Tech.
ChEMBL_940752 (CHEMBL2330132)
IC50
100±n/a nM
Citation
 Jiang, XRWang, PSmith, CLZhu, BT Synthesis of novel estrogen receptor antagonists using metal-catalyzed coupling reactions and characterization of their biological activity. J Med Chem 56:2779-90 (2013)  
Target
Name:
Steroid hormone receptor ERR1
Synonyms:
ERR-alpha ERR1_HUMAN ESRRA Estrogen-Related Receptor, alpha NR3B1 Steroid hormone receptor ERR1 Steroid hormone receptor ERR1/Estrogen-related receptor alpha (ERRa) | von Hippel-Lindau disease tumor suppressor/Steroid hormone receptor ERR1
Type:
PROTEIN
Mol. Mass.:
45508.08
Organism:
Homo sapiens (Human)
Description:
ChEMBL_1499891
Residue:
423
  
Inhibitor
Name:
BDBM50427836
Synonyms:
CHEMBL2326070
Type:
Small organic molecule
Emp. Form.:
C33H37N3O5
Mol. Mass.:
555.664
SMILES:
C[C@]12CC[C@H]3[C@H]([C@@H]1CC[C@@H]2O)[C@H](CCCCc1cn(nn1)-c1cc2ccc(O)cc2oc1=O)Cc1cc(O)ccc31
: