Target
Coagulation factor XI
Ligand
BDBM50427860
Substrate
Meas. Tech.
ChEMBL_940757 (CHEMBL2330137)
IC50
102000±n/a nM
Citation
 Karuturi, RAl-Horani, RAMehta, SCGailani, DDesai, UR Discovery of allosteric modulators of factor XIa by targeting hydrophobic domains adjacent to its heparin-binding site. J Med Chem 56:2415-28 (2013)  
Target
Name:
Coagulation factor XI
Synonyms:
Coagulation factor XIa Coagulation factor XIa light chain FA11_HUMAN Factor XIa PTA | Plasma thromboplastin antecedent
Type:
Enzyme
Mol. Mass.:
70130.58
Organism:
Homo sapiens (Human)
Description:
P03951
Residue:
625
  
Inhibitor
Name:
BDBM50427860
Synonyms:
CHEMBL2326078
Type:
Small organic molecule
Emp. Form.:
C35H29N7O10S2
Mol. Mass.:
771.776
SMILES:
OS(=O)(=O)Oc1cccc(c1)-c1nc2ccccc2c(=O)n1CCCCn1cc(Cn2c(nc3ccccc3c2=O)-c2cccc(OS(O)(=O)=O)c2)nn1
: