Target
Protein-serine O-palmitoleoyltransferase porcupine
Ligand
BDBM37088
Substrate
Meas. Tech.
ChEMBL_941167 (CHEMBL2330993)
EC50
15±n/a nM
Citation
 Wang, XMoon, JDodge, MEPan, XZhang, LHanson, JMTuladhar, RMa, ZShi, HWilliams, NSAmatruda, JFCarroll, TJLum, LChen, C The development of highly potent inhibitors for porcupine. J Med Chem 56:2700-4 (2013)  
Target
Name:
Protein-serine O-palmitoleoyltransferase porcupine
Synonyms:
PORCN_MOUSE Porcn Probable protein-cysteine N-palmitoyltransferase porcupine mPORC
Type:
PROTEIN
Mol. Mass.:
52528.36
Organism:
Mus musculus
Description:
ChEMBL_941167
Residue:
461
  
Inhibitor
Name:
BDBM37088
Synonyms:
2-[(3,6-dimethyl-4-oxidanylidene-6,7-dihydrothieno[3,2-d]pyrimidin-2-yl)sulfanyl]-N-(6-methyl-1,3-benzothiazol-2-yl)ethanamide 2-[(3,6-dimethyl-4-oxo-6,7-dihydrothieno[3,2-d]pyrimidin-2-yl)sulfanyl]-N-(6-methyl-1,3-benzothiazol-2-yl)acetamide 2-[(4-keto-3,6-dimethyl-6,7-dihydrothieno[3,2-d]pyrimidin-2-yl)thio]-N-(6-methyl-1,3-benzothiazol-2-yl)acetamide SMR000025621 | cid_3244448
Type:
Small organic molecule
Emp. Form.:
C18H18N4O2S3
Mol. Mass.:
418.556
SMILES:
CC1Cc2nc(SCC(=O)Nc3nc4ccc(C)cc4s3)n(C)c(=O)c2S1
: