Target
Protein-serine O-palmitoleoyltransferase porcupine
Ligand
BDBM50428031
Substrate
Meas. Tech.
ChEMBL_941167 (CHEMBL2330993)
EC50
240±n/a nM
Citation
 Wang, XMoon, JDodge, MEPan, XZhang, LHanson, JMTuladhar, RMa, ZShi, HWilliams, NSAmatruda, JFCarroll, TJLum, LChen, C The development of highly potent inhibitors for porcupine. J Med Chem 56:2700-4 (2013)  
Target
Name:
Protein-serine O-palmitoleoyltransferase porcupine
Synonyms:
PORCN_MOUSE Porcn Probable protein-cysteine N-palmitoyltransferase porcupine mPORC
Type:
PROTEIN
Mol. Mass.:
52528.36
Organism:
Mus musculus
Description:
ChEMBL_941167
Residue:
461
  
Inhibitor
Name:
BDBM50428031
Synonyms:
CHEMBL2325507
Type:
Small organic molecule
Emp. Form.:
C24H16N6O5S
Mol. Mass.:
500.486
SMILES:
[O-][N+](=O)c1ccc2nc(NC(=O)CNC(=O)c3nn(-c4ccccc4)c(=O)c4ccccc34)sc2c1
: