Target
Ephrin type-A receptor 2
Ligand
BDBM50375588
Substrate
Meas. Tech.
ChEMBL_941272 (CHEMBL2329862)
IC50
138000±n/a nM
Citation
 Incerti, MTognolini, MRusso, SPala, DGiorgio, CHassan-Mohamed, INoberini, RPasquale, EBVicini, PPiersanti, SRivara, SBarocelli, EMor, MLodola, A Amino acid conjugates of lithocholic acid as antagonists of the EphA2 receptor. J Med Chem 56:2936-47 (2013)  
Target
Name:
Ephrin type-A receptor 2
Synonyms:
ECK EPHA2_HUMAN Epithelial cell kinase | Tyrosine-protein kinase receptor ECK
Type:
PROTEIN
Mol. Mass.:
108260.70
Organism:
Homo sapiens (Human)
Description:
ChEMBL_1505248
Residue:
976
  
Inhibitor
Name:
BDBM50375588
Synonyms:
CHEMBL258818 | LCAGLY
Type:
Small organic molecule
Emp. Form.:
C26H43NO4
Mol. Mass.:
433.6239
SMILES:
C[C@H](CCC(=O)NCC(O)=O)[C@H]1CC[C@H]2[C@@H]3CC[C@@H]4C[C@H](O)CC[C@]4(C)[C@H]3CC[C@]12C
: