Target
Neuraminidase
Ligand
BDBM50428070
Substrate
Meas. Tech.
ChEMBL_941624 (CHEMBL2330706)
IC50
>1000000±n/a nM
Citation
 Zhang, YAlbohy, AZou, YSmutova, VPshezhetsky, AVCairo, CW Identification of selective inhibitors for human neuraminidase isoenzymes using C4,C7-modified 2-deoxy-2,3-didehydro-N-acetylneuraminic acid (DANA) analogues. J Med Chem 56:2948-58 (2013)  
Target
Name:
Neuraminidase
Synonyms:
nanH
Type:
PROTEIN
Mol. Mass.:
88686.49
Organism:
Vibrio cholerae
Description:
ChEMBL_941624
Residue:
807
  
Inhibitor
Name:
BDBM50428070
Synonyms:
CHEMBL2325812
Type:
Small organic molecule
Emp. Form.:
C23H25N5O5
Mol. Mass.:
451.4751
SMILES:
CC(=O)N[C@H]1[C@H](CN(Cc2ccccc2)OCc2ccccc2)OC(=C[C@@H]1N=[N+]=[N-])C(O)=O
: