Target
Cannabinoid receptor 1
Ligand
BDBM50428091
Substrate
Meas. Tech.
ChEMBL_943918 (CHEMBL2339885)
Ki
>10000±n/a nM
Citation
 Rempel, VFuchs, AHinz, SKarcz, TLehr, MKoetter, UMüller, CE Magnolia Extract, Magnolol, and Metabolites: Activation of Cannabinoid CB2 Receptors and Blockade of the Related GPR55. ACS Med Chem Lett 4:41-5 (2013)  
Target
Name:
Cannabinoid receptor 1
Synonyms:
CANN6 CB-R CNR CNR1_HUMAN Cannabinoid receptor Cannabinoid receptor 1 (brain)
Type:
G Protein-Coupled Receptor (GPCR)
Mol. Mass.:
52868.96
Organism:
Homo sapiens (Human)
Description:
P21554
Residue:
472
  
Inhibitor
Name:
BDBM50428091
Synonyms:
CHEMBL179840
Type:
Small organic molecule
Emp. Form.:
C18H18O2
Mol. Mass.:
266.3343
SMILES:
C\C=C\c1ccc(O)c(c1)-c1cc(\C=C\C)ccc1O
: