Target
Carbonic anhydrase 7
Ligand
BDBM50362849
Substrate
Meas. Tech.
ChEMBL_942104 (CHEMBL2340802)
Ki
690±n/a nM
Citation
 Carta, FVullo, DMaresca, AScozzafava, ASupuran, CT Mono-/dihydroxybenzoic acid esters and phenol pyridinium derivatives as inhibitors of the mammalian carbonic anhydrase isoforms I, II, VII, IX, XII and XIV. Bioorg Med Chem 21:1564-9 (2013)  
Target
Name:
Carbonic anhydrase 7
Synonyms:
CA-VII CAH7_HUMAN Carbonic anhydrase Carbonic anhydrase VII (CA VII)
Type:
Enzyme
Mol. Mass.:
29664.11
Organism:
Homo sapiens (Human)
Description:
Human cloned isozyme.
Residue:
264
  
Inhibitor
Name:
BDBM50362849
Synonyms:
CHEMBL1940391
Type:
Small organic molecule
Emp. Form.:
C12H14O3
Mol. Mass.:
206.2378
SMILES:
CC(C)OC(=O)\C=C\c1ccc(O)cc1
: