Target
LD26647p
Ligand
BDBM50382715
Substrate
Meas. Tech.
ChEMBL_942137 (CHEMBL2341293)
Ki
3.9±n/a nM
Citation
 Syrjänen, LTolvanen, MEHilvo, MVullo, DCarta, FSupuran, CTParkkila, S Characterization, bioinformatic analysis and dithiocarbamate inhibition studies of two newa-carbonic anhydrases, CAH1 and CAH2, from the fruit fly Drosophila melanogaster. Bioorg Med Chem 21:1516-21 (2013)  
Target
Name:
LD26647p
Synonyms:
CAH2 Dmel_CG6906 | LD26647p
Type:
PROTEIN
Mol. Mass.:
37674.24
Organism:
Drosophila melanogaster
Description:
ChEMBL_942137
Residue:
335
  
Inhibitor
Name:
BDBM50382715
Synonyms:
CHEMBL2023720
Type:
Small organic molecule
Emp. Form.:
C7H14NS2
Mol. Mass.:
176.323
SMILES:
CCCN(CCC)C([S-])=S
: