Target
LD26647p
Ligand
BDBM50010231
Substrate
Meas. Tech.
ChEMBL_942137 (CHEMBL2341293)
Ki
654±n/a nM
Citation
 Syrjänen, LTolvanen, MEHilvo, MVullo, DCarta, FSupuran, CTParkkila, S Characterization, bioinformatic analysis and dithiocarbamate inhibition studies of two newa-carbonic anhydrases, CAH1 and CAH2, from the fruit fly Drosophila melanogaster. Bioorg Med Chem 21:1516-21 (2013)  
Target
Name:
LD26647p
Synonyms:
CAH2 Dmel_CG6906 | LD26647p
Type:
PROTEIN
Mol. Mass.:
37674.24
Organism:
Drosophila melanogaster
Description:
ChEMBL_942137
Residue:
335
  
Inhibitor
Name:
BDBM50010231
Synonyms:
CHEMBL107217 Sodium salt of Diethyl-dithiocarbamic acid(DDC) sodium N,N-diethyl-dithiocarbamate | sodium diethyldithiocarbamate
Type:
Small organic molecule
Emp. Form.:
C5H10NS2
Mol. Mass.:
148.27
SMILES:
CCN(CC)C([S-])=S
: