Target
Carbonic anhydrase
Ligand
BDBM50382728
Substrate
Meas. Tech.
ChEMBL_942138 (CHEMBL2341294)
Ki
14±n/a nM
Citation
 Syrjänen, LTolvanen, MEHilvo, MVullo, DCarta, FSupuran, CTParkkila, S Characterization, bioinformatic analysis and dithiocarbamate inhibition studies of two newa-carbonic anhydrases, CAH1 and CAH2, from the fruit fly Drosophila melanogaster. Bioorg Med Chem 21:1516-21 (2013)  
Target
Name:
Carbonic anhydrase
Synonyms:
CAH1 Dmel_CG7820 | GH09688p
Type:
PROTEIN
Mol. Mass.:
29950.70
Organism:
Drosophila melanogaster
Description:
ChEMBL_942138
Residue:
270
  
Inhibitor
Name:
BDBM50382728
Synonyms:
CHEMBL2023727
Type:
Small organic molecule
Emp. Form.:
C5H8NOS2
Mol. Mass.:
162.254
SMILES:
[S-]C(=S)N1CCOCC1
: