Target
5-hydroxytryptamine receptor 2A
Ligand
BDBM50428541
Substrate
Meas. Tech.
ChEMBL_944530 (CHEMBL2346333)
EC50
21±n/a nM
Citation
 Fevig, JMFeng, JRossi, KAMiller, KJWu, GHung, CPUng, TMalmstrom, SEZhang, GKeim, WJCullen, MJRohrbach, KWQu, QGan, JPelleymounter, MARobl, JA Synthesis and SAR of 2,3,3a,4-tetrahydro-1H-pyrrolo[3,4-c]isoquinolin-5(9bH)-ones as 5-HT2C receptor agonists. Bioorg Med Chem Lett 23:330-5 (2012)  
Target
Name:
5-hydroxytryptamine receptor 2A
Synonyms:
5-HT-2 5-HT2A 5-hydroxytryptamine receptor 2A (5HT-2A) 5HT2A_HUMAN HTR2A | Serotonin receptor 2A
Type:
undefined
Mol. Mass.:
52607.65
Organism:
Homo sapiens (Human)
Description:
P28223
Residue:
471
  
Inhibitor
Name:
BDBM50428541
Synonyms:
CHEMBL2337501
Type:
Small organic molecule
Emp. Form.:
C12H13ClN2O
Mol. Mass.:
236.697
SMILES:
Cc1ccc2[C@H]3CNC[C@@H]3NC(=O)c2c1Cl
: