Target
Androgen receptor
Ligand
BDBM50428547
Substrate
Meas. Tech.
ChEMBL_944553 (CHEMBL2339069)
IC50
120±n/a nM
Citation
 Yamamoto, SKobayashi, HKaku, TAikawa, KHara, TYamaoka, MKanzaki, NHasuoka, ABaba, AIto, M Design, synthesis, and biological evaluation of 3-aryl-3-hydroxy-1-phenylpyrrolidine derivatives as novel androgen receptor antagonists. Bioorg Med Chem 21:70-83 (2012)  
Target
Name:
Androgen receptor
Synonyms:
ANDR_HUMAN Androgen Receptor Androgen receptor/Baculoviral IAP repeat-containing protein 2 Dihydrotestosterone receptor Nuclear receptor subfamily 3 group C member 4
Type:
Receptor
Mol. Mass.:
99185.27
Organism:
Homo sapiens (Human)
Description:
CHO cells were stably transfected with human AR gene.
Residue:
920
  
Inhibitor
Name:
BDBM50428547
Synonyms:
CHEMBL2337517
Type:
Small organic molecule
Emp. Form.:
C20H22N4O3
Mol. Mass.:
366.4137
SMILES:
CNC(=O)c1ccc(cn1)[C@]1(O)CCN([C@H]1C)c1ccc(C#N)c(OC)c1
: