Target
Androgen receptor
Ligand
BDBM50428558
Substrate
Meas. Tech.
ChEMBL_944551 (CHEMBL2339067)
IC50
1000±n/a nM
Citation
 Yamamoto, SKobayashi, HKaku, TAikawa, KHara, TYamaoka, MKanzaki, NHasuoka, ABaba, AIto, M Design, synthesis, and biological evaluation of 3-aryl-3-hydroxy-1-phenylpyrrolidine derivatives as novel androgen receptor antagonists. Bioorg Med Chem 21:70-83 (2012)  
Target
Name:
Androgen receptor
Synonyms:
ANDR_HUMAN Androgen Receptor Androgen receptor/Baculoviral IAP repeat-containing protein 2 Dihydrotestosterone receptor Nuclear receptor subfamily 3 group C member 4
Type:
Receptor
Mol. Mass.:
99185.27
Organism:
Homo sapiens (Human)
Description:
CHO cells were stably transfected with human AR gene.
Residue:
920
  
Inhibitor
Name:
BDBM50428558
Synonyms:
CHEMBL2337505
Type:
Small organic molecule
Emp. Form.:
C18H17ClN2O
Mol. Mass.:
312.793
SMILES:
OC1(Cc2ccccc2)CCN(C1)c1ccc(C#N)c(Cl)c1
: