Target
Carbonic anhydrase 1
Ligand
BDBM50387127
Substrate
Meas. Tech.
ChEMBL_946062 (CHEMBL2342099)
Ki
5463±n/a nM
Citation
 Tarko, LSupuran, CT QSAR studies of sulfamate and sulfamide inhibitors targeting human carbonic anhydrase isozymes I, II, IX and XII. Bioorg Med Chem 21:1404-9 (2013)  
Target
Name:
Carbonic anhydrase 1
Synonyms:
CA-I CAB Carbonate dehydratase I Carbonic anhydrase 1 (CA I) Carbonic anhydrase 1 (Recombinant CA I) Carbonic anhydrase B Carbonic anhydrase I (CA I) Carbonic anhydrase I (CAI) Carbonic anhydrase isoenzyme I (hCA I) | hCA
Type:
Enzyme
Mol. Mass.:
28873.37
Organism:
Homo sapiens (Human)
Description:
P00915
Residue:
261
  
Inhibitor
Name:
BDBM50387127
Synonyms:
4-ureidophenyl sulfamate ring derivative 3l | CHEMBL2047807
Type:
Small organic molecule
Emp. Form.:
C15H17N3O4S
Mol. Mass.:
335.378
SMILES:
NS(=O)(=O)Oc1ccc(NC(=O)NCCc2ccccc2)cc1
: