Target
Tyrosine-protein kinase ABL1
Ligand
BDBM50299218
Substrate
Meas. Tech.
ChEMBL_947986 (CHEMBL2344636)
IC50
0.920000±n/a nM
Citation
 Lafleur, KDong, JHuang, DCaflisch, ANevado, C Optimization of inhibitors of the tyrosine kinase EphB4. 2. Cellular potency improvement and binding mode validation by X-ray crystallography. J Med Chem 56:84-96 (2013)  
Target
Name:
Tyrosine-protein kinase ABL1
Synonyms:
ABL ABL1_HUMAN JTK7 Proto-oncogene tyrosine-protein kinase ABL1 Tyrosine-protein kinase ABL V-abl Abelson murine leukemia viral oncogene homolog 1 p150 | tyrosine-protein kinase ABL1 isoform a
Type:
Enzyme
Mol. Mass.:
122897.30
Organism:
Homo sapiens (Human)
Description:
P00519
Residue:
1130
  
Inhibitor
Name:
BDBM50299218
Synonyms:
8-(2-Methoxyphenyl)-1-methyl-7-(2'-methyl-5'-hydroxyphenyl-1H-imidazo[2,1-f]purine-2,4(3H,8H)-dione Cpd66
Type:
Small organic molecule
Emp. Form.:
C22H19N5O4
Mol. Mass.:
417.4174
SMILES:
COc1ccccc1-n1c(cn2c1nc1n(C)c(=O)[nH]c(=O)c21)-c1cc(O)ccc1C
: