Target
Peroxisome proliferator-activated receptor gamma
Ligand
BDBM50299414
Substrate
Meas. Tech.
ChEMBL_948911 (CHEMBL2341205)
EC50
26940±n/a nM
Citation
 Matin, ADoddareddy, MRGavande, NNammi, SGroundwater, PWRoubin, RHHibbs, DE The discovery of novel isoflavone pan peroxisome proliferator-activated receptor agonists. Bioorg Med Chem 21:766-78 (2013)  
Target
Name:
Peroxisome proliferator-activated receptor gamma
Synonyms:
NR1C3 PPAR-gamma PPARG_HUMAN Peroxisome proliferator-activated receptor gamma (PPAR gamma) Peroxisome proliferator-activated receptor gamma (PPARĪ³) peroxisome proliferator-activated receptor gamma isoform 2
Type:
Nuclear Receptor
Mol. Mass.:
57613.46
Organism:
Homo sapiens (Human)
Description:
P37231
Residue:
505
  
Inhibitor
Name:
BDBM50299414
Synonyms:
3-(benzo[d][1,3]dioxol-5-yl)-7-hydroxy-4H-chromen-4-one NSC-100796 pseudobaptogenin | psi-baptigenin
Type:
Small organic molecule
Emp. Form.:
C16H10O5
Mol. Mass.:
282.2476
SMILES:
Oc1ccc2c(c1)occ(-c1ccc3OCOc3c1)c2=O
: