Target
Acetylcholinesterase
Ligand
BDBM50423877
Substrate
Meas. Tech.
ChEMBL_944079 (CHEMBL2341912)
Ki
>100000±n/a nM
Citation
 Hatfield, MJTsurkan, LGHyatt, JLEdwards, CCLemoff, AJeffries, CYan, BPotter, PM Modulation of esterified drug metabolism by tanshinones from Salvia miltiorrhiza ("Danshen"). J Nat Prod 76:36-44 (2013)  
Target
Name:
Acetylcholinesterase
Synonyms:
ACES_HUMAN Acetylcholinesterase (AChE) | Acetylcholinesterase (human AChE)
Type:
Enzyme
Mol. Mass.:
67792.70
Organism:
Homo sapiens (Human)
Description:
P22303
Residue:
614
  
Inhibitor
Name:
BDBM50423877
Synonyms:
DIHYDROTANSHINONE acs.jmedchem.1c00409_ST.562
Type:
Small organic molecule
Emp. Form.:
C18H14O3
Mol. Mass.:
278.302
SMILES:
C[C@H]1COC2=C1C(=O)C(=O)c1c2ccc2c(C)cccc12
: