Target
Liver carboxylesterase 1
Ligand
BDBM50350328
Substrate
Meas. Tech.
ChEMBL_944083 (CHEMBL2341916)
Ki
7.6±n/a nM
Citation
 Hatfield, MJTsurkan, LGHyatt, JLEdwards, CCLemoff, AJeffries, CYan, BPotter, PM Modulation of esterified drug metabolism by tanshinones from Salvia miltiorrhiza ("Danshen"). J Nat Prod 76:36-44 (2013)  
Target
Name:
Liver carboxylesterase 1
Synonyms:
Acyl coenzyme A:cholesterol acyltransferase CES1 EST1_HUMAN Serine hydrolase (CES1)
Type:
Protein
Mol. Mass.:
62520.83
Organism:
Homo sapiens (Human)
Description:
Residue:
567
  
Inhibitor
Name:
BDBM50350328
Synonyms:
CHEMBL1812858
Type:
Small organic molecule
Emp. Form.:
C16H30O2
Mol. Mass.:
254.4082
SMILES:
CCCCCCCC(=O)C(=O)CCCCCCC
: