Target
Liver carboxylesterase 1
Ligand
BDBM22853
Substrate
Meas. Tech.
ChEMBL_944083 (CHEMBL2341916)
Ki
31±n/a nM
Citation
 Hatfield, MJTsurkan, LGHyatt, JLEdwards, CCLemoff, AJeffries, CYan, BPotter, PM Modulation of esterified drug metabolism by tanshinones from Salvia miltiorrhiza ("Danshen"). J Nat Prod 76:36-44 (2013)  
Target
Name:
Liver carboxylesterase 1
Synonyms:
Acyl coenzyme A:cholesterol acyltransferase CES1 EST1_HUMAN Serine hydrolase (CES1)
Type:
Protein
Mol. Mass.:
62520.83
Organism:
Homo sapiens (Human)
Description:
Residue:
567
  
Inhibitor
Name:
BDBM22853
Synonyms:
1,2-Dione-Based Compound, 10 | 1,2-dihydroacenaphthylenedione
Type:
Small organic molecule
Emp. Form.:
C12H6O2
Mol. Mass.:
182.1748
SMILES:
O=c1c2cccc3cccc(c23)c1=O
: