Target
Peroxisome proliferator-activated receptor gamma
Ligand
BDBM50099491
Substrate
Meas. Tech.
ChEMBL_944087 (CHEMBL2341920)
Kd
180±n/a nM
Citation
 de Groot, JCWeidner, CKrausze, JKawamoto, KSchroeder, FCSauer, SBüssow, K Structural characterization of amorfrutins bound to the peroxisome proliferator-activated receptor¿. J Med Chem 56:1535-43 (2013)  
Target
Name:
Peroxisome proliferator-activated receptor gamma
Synonyms:
NR1C3 PPAR-gamma PPARG_HUMAN Peroxisome proliferator-activated receptor gamma (PPAR gamma) Peroxisome proliferator-activated receptor gamma (PPARĪ³) peroxisome proliferator-activated receptor gamma isoform 2
Type:
Nuclear Receptor
Mol. Mass.:
57613.46
Organism:
Homo sapiens (Human)
Description:
P37231
Residue:
505
  
Inhibitor
Name:
BDBM50099491
Synonyms:
2-(4-(2-(3-cyclohexyl-1-(4-cyclohexylbutyl)ureido)ethyl)phenylthio)-2-methylpropanoic acid CHEMBL21241 cid_3392731
Type:
Small organic molecule
Emp. Form.:
C29H46N2O3S
Mol. Mass.:
502.752
SMILES:
CC(C)(Sc1ccc(CCN(CCCCC2CCCCC2)C(=O)NC2CCCCC2)cc1)C(O)=O
: