Target
72 kDa type IV collagenase
Ligand
BDBM50137279
Substrate
Meas. Tech.
ChEMBL_944583 (CHEMBL2339488)
IC50
0.076000±n/a nM
Citation
 Jain, PSaravanan, CSingh, SK Sulphonamides: Deserving class as MMP inhibitors? Eur J Med Chem 60:89-100 (2013)  
Target
Name:
72 kDa type IV collagenase
Synonyms:
72 kDa gelatinase CLG4A Gelatinase A (MMP-2) MMP2_HUMAN Matrix metalloproteinase-2 (MMP 2) Matrix metalloproteinases 2 (MMP-2) | TBE-1
Type:
Enzyme
Mol. Mass.:
73870.36
Organism:
Homo sapiens (Human)
Description:
P08253
Residue:
660
  
Inhibitor
Name:
BDBM50137279
Synonyms:
6-Hydroxy-2-(4-nitro-benzenesulfonyl)-1,2,3,4-tetrahydro-isoquinoline-1-carboxylic acid hydroxyamide N,6-dihydroxy-2-(4-nitrophenylsulfonyl)-1,2,3,4-tetrahydroisoquinoline-1-carboxamide
Type:
Small organic molecule
Emp. Form.:
C16H15N3O7S
Mol. Mass.:
393.371
SMILES:
ONC(=O)C1N(CCc2cc(O)ccc12)S(=O)(=O)c1ccc(cc1)[N+]([O-])=O
: