Target
Carbonic anhydrase 12
Ligand
BDBM50428835
Substrate
Meas. Tech.
ChEMBL_944593 (CHEMBL2339498)
Ki
2.4±n/a nM
Citation
 Alafeefy, AMIsik, SAbdel-Aziz, HAAshour, AEVullo, DAl-Jaber, NASupuran, CT Carbonic anhydrase inhibitors: benzenesulfonamides incorporating cyanoacrylamide moieties are low nanomolar/subnanomolar inhibitors of the tumor-associated isoforms IX and XII. Bioorg Med Chem 21:1396-403 (2013)  
Target
Name:
Carbonic anhydrase 12
Synonyms:
CA-XII CAH12_HUMAN Carbonic anhydrase Carbonic anhydrase XII Carbonic anhydrase XII (CAXII) | Tumor antigen HOM-RCC-3.1.3
Type:
Enzyme
Mol. Mass.:
39456.00
Organism:
Homo sapiens (Human)
Description:
Catalytic domain of human cloned isozyme was used in the assay
Residue:
354
  
Inhibitor
Name:
BDBM50428835
Synonyms:
CHEMBL2337533
Type:
Small organic molecule
Emp. Form.:
C18H15N3O3S
Mol. Mass.:
353.395
SMILES:
NS(=O)(=O)c1ccc(NC(=O)C(=C\C=C\c2ccccc2)\C#N)cc1
: