Target
Carbonic anhydrase 9
Ligand
BDBM50428843
Substrate
Meas. Tech.
ChEMBL_944594 (CHEMBL2339499)
Ki
21±n/a nM
Citation
 Alafeefy, AMIsik, SAbdel-Aziz, HAAshour, AEVullo, DAl-Jaber, NASupuran, CT Carbonic anhydrase inhibitors: benzenesulfonamides incorporating cyanoacrylamide moieties are low nanomolar/subnanomolar inhibitors of the tumor-associated isoforms IX and XII. Bioorg Med Chem 21:1396-403 (2013)  
Target
Name:
Carbonic anhydrase 9
Synonyms:
CA-IX CAH9_HUMAN Carbonic anhydrase 9 (CA IX) Carbonic anhydrase 9 precursor Carbonic anhydrase IX (CAIX) Carbonic anhydrases; II & IX MN RCC-associated antigen G250
Type:
Enzyme
Mol. Mass.:
49669.03
Organism:
Homo sapiens (Human)
Description:
Catalytic domain of human cloned isozyme was used in the assay
Residue:
459
  
Inhibitor
Name:
BDBM50428843
Synonyms:
CHEMBL2337132
Type:
Small organic molecule
Emp. Form.:
C19H19N3O6S
Mol. Mass.:
417.436
SMILES:
COc1cc(\C=C(/C#N)C(=O)Nc2ccc(cc2)S(N)(=O)=O)cc(OC)c1OC
: