Target
HTH-type transcriptional regulator MgrA
Ligand
BDBM81553
Substrate
Meas. Tech.
ChEMBL_944630 (CHEMBL2339937)
IC50
30000±n/a nM
Citation
 Gordon, CPWilliams, PChan, WC Attenuating Staphylococcus aureus virulence gene regulation: a medicinal chemistry perspective. J Med Chem 56:1389-404 (2013)  
Target
Name:
HTH-type transcriptional regulator MgrA
Synonyms:
HTH-type transcriptional regulator mgrA (MgrA) Regulator of autolytic activity mgrA
Type:
Protein
Mol. Mass.:
17090.77
Organism:
Staphylococcus aureus
Description:
P0C1S0
Residue:
147
  
Inhibitor
Name:
BDBM81553
Synonyms:
MgrA inhibitor, 2
Type:
Small organic molecule
Emp. Form.:
C16H17NO4
Mol. Mass.:
287.3105
SMILES:
Cc1ccc(C)n1[C@@H](CC(O)=O)c1ccc2OCOc2c1
: