Target
Integrin alpha-4/beta-7
Ligand
BDBM50428917
Substrate
Meas. Tech.
ChEMBL_947490 (CHEMBL2346014)
IC50
160±n/a nM
Citation
 Tilley, JWSidduri, ALou, JKaplan, GTare, NCavallo, GFrank, KPamidimukkala, AChoi, DSGerber, LRailkar, ARenzetti, L Identification of N-acyl 4-(3-pyridonyl)phenylalanine derivatives and their orally active prodrug esters as dual actinga4ß1 anda4ß7 receptor antagonists. Bioorg Med Chem Lett 23:1036-40 (2013)  
Target
Name:
Integrin alpha-4/beta-7
Synonyms:
Integrin α4β7 Integrin alpha-4/beta7 | Integrin alpha4beta7
Type:
Protein Complex
Mol. Mass.:
Description:
The assay uses stably transfected K562 cells expressing human alpha4beta7 integrin.
Components:
This complex has 2 components.
Component 1
Name:
Integrin alpha-4
Synonyms:
CD49 antigen-like family member D CD49d antigen ITA4_HUMAN Integrin alpha-4 Integrin alpha-IV VLA-4 integrin alpha 4 precursor | integrin alpha-4 precursor
Type:
Membrane Protein
Mol. Mass.:
114897.35
Organism:
Homo sapiens (Human)
Description:
P13612
Residue:
1032
  
Component 2
Name:
Integrin beta-7
Synonyms:
ITB7_HUMAN Integrin alpha-4/beta-7 Integrin beta7
Type:
Membrane Protein
Mol. Mass.:
86893.88
Organism:
Homo sapiens (Human)
Description:
P26010
Residue:
798
  
Inhibitor
Name:
BDBM50428917
Synonyms:
CHEMBL2332728
Type:
Small organic molecule
Emp. Form.:
C25H22ClF3N2O4
Mol. Mass.:
506.901
SMILES:
Cc1cccc(Cl)c1C(=O)N[C@@H](Cc1ccc(cc1)-c1c(C)cc(n(C)c1=O)C(F)(F)F)C(O)=O
: