Target
Integrin alpha-4/beta-1
Ligand
BDBM50428944
Substrate
Meas. Tech.
ChEMBL_947529 (CHEMBL2339235)
IC50
35±n/a nM
Citation
 Sidduri, ATilley, JWLou, JTare, NCavallo, GFrank, KPamidimukkala, AChoi, DSGerber, LRailkar, ARenzetti, L Identification of N-acyl 4-(5-pyrimidine-2,4-dionyl)phenylalanine derivatives and their orally active prodrug esters as dual-acting alpha4-beta1 and alpha4-beta7 receptor antagonists. Bioorg Med Chem Lett 23:1026-31 (2013)  
Target
Name:
Integrin alpha-4/beta-1
Synonyms:
Fibronectin receptor beta/Integrin alpha-4 | Integrin alpha-4/beta-1
Type:
Mol. Mass.:
Description:
ASSAY_ID of EBI is 88912
Components:
This complex has 2 components.
Component 1
Name:
Integrin beta-1
Synonyms:
CD_antigen=CD29 Fibronectin receptor beta GPIIA ITGB1 MDF2 | MSK12
Type:
Enzyme
Mol. Mass.:
88400.38
Organism:
Homo sapiens (Human)
Description:
P05556
Residue:
798
  
Component 2
Name:
Integrin alpha-4
Synonyms:
CD49 antigen-like family member D CD49d antigen ITA4_HUMAN Integrin alpha-4 Integrin alpha-IV VLA-4 integrin alpha 4 precursor | integrin alpha-4 precursor
Type:
Membrane Protein
Mol. Mass.:
114897.35
Organism:
Homo sapiens (Human)
Description:
P13612
Residue:
1032
  
Inhibitor
Name:
BDBM50428944
Synonyms:
CHEMBL2333170
Type:
Small organic molecule
Emp. Form.:
C24H24ClN3O5
Mol. Mass.:
469.917
SMILES:
Cc1cccc(Cl)c1C(=O)N[C@@H](Cc1ccc(cc1)-c1c(C)n(C)c(=O)n(C)c1=O)C(O)=O
: