Target
Platelet-activating factor acetylhydrolase
Ligand
BDBM50429112
Substrate
Meas. Tech.
ChEMBL_943196 (CHEMBL2346227)
IC50
16±n/a nM
Citation
 Hu, YLin, ECPham, LMCajica, JAmantea, CMOkerberg, EBrown, HEFraser, ADu, LKohno, YIshiyama, JKozarich, JWShreder, KR Amides of 4-hydroxy-8-methanesulfonylamino-quinoline-2-carboxylic acid as zinc-dependent inhibitors of Lp-PLA2. Bioorg Med Chem Lett 23:1553-6 (2013)  
Target
Name:
Platelet-activating factor acetylhydrolase
Synonyms:
1-alkyl-2-acetylglycerophosphocholine esterase LDL-PLA(2) PAF 2-acylhydrolase PAFAH PLA2G7 | Platelet-activating factor acetylhydrolase
Type:
PROTEIN
Mol. Mass.:
50084.41
Organism:
Homo sapiens (Human)
Description:
ChEMBL_156212
Residue:
441
  
Inhibitor
Name:
BDBM50429112
Synonyms:
CHEMBL2335760
Type:
Small organic molecule
Emp. Form.:
C18H17N3O4S
Mol. Mass.:
371.41
SMILES:
Cc1ccccc1NC(=O)c1cc(O)c2cccc(NS(C)(=O)=O)c2n1
: