Target
Carbonic anhydrase 12
Ligand
BDBM50429222
Substrate
Meas. Tech.
ChEMBL_946163 (CHEMBL2343565)
Ki
32±n/a nM
Citation
 Güzel-Akdemir, ÖAkdemir, AIsik, SVullo, DSupuran, CT o-Benzenedisulfonimido-sulfonamides are potent inhibitors of the tumor-associated carbonic anhydrase isoforms CA IX and CA XII. Bioorg Med Chem 21:1386-91 (2013)  
Target
Name:
Carbonic anhydrase 12
Synonyms:
CA-XII CAH12_HUMAN Carbonic anhydrase Carbonic anhydrase XII Carbonic anhydrase XII (CAXII) | Tumor antigen HOM-RCC-3.1.3
Type:
Enzyme
Mol. Mass.:
39456.00
Organism:
Homo sapiens (Human)
Description:
Catalytic domain of human cloned isozyme was used in the assay
Residue:
354
  
Inhibitor
Name:
BDBM50429222
Synonyms:
CHEMBL2331569
Type:
Small organic molecule
Emp. Form.:
C14H14N2O6S3
Mol. Mass.:
402.466
SMILES:
NS(=O)(=O)c1ccc(CCN2S(=O)(=O)c3ccccc3S2(=O)=O)cc1
: