Target
Macrophage metalloelastase
Ligand
BDBM50429232
Substrate
Meas. Tech.
ChEMBL_946628 (CHEMBL2342136)
IC50
2300±n/a nM
Citation
 Yuan, HLu, WWang, LShan, LLi, HHuang, JSun, QZhang, W Synthesis of derivatives of methyl rosmarinate and their inhibitory activities against matrix metalloproteinase-1 (MMP-1). Eur J Med Chem 62:148-57 (2013)  
Target
Name:
Macrophage metalloelastase
Synonyms:
HME MMP12_HUMAN Matrix metalloproteinase-12 (MMP 12) Matrix metalloproteinase-12 (MMP12) | Matrix metalloproteinases 12 (MMP-12)
Type:
Enzyme
Mol. Mass.:
54012.99
Organism:
Homo sapiens (Human)
Description:
P39900
Residue:
470
  
Inhibitor
Name:
BDBM50429232
Synonyms:
CHEMBL2333288
Type:
Small organic molecule
Emp. Form.:
C34H32O8
Mol. Mass.:
568.6131
SMILES:
COc1ccc(C[C@H](OC(=O)\C=C\c2ccc(OCc3ccccc3)c(OCc3ccccc3)c2)C(O)=O)cc1OC
: