Target
Metabotropic glutamate receptor 1
Ligand
BDBM50429412
Substrate
Meas. Tech.
ChEMBL_942303 (CHEMBL2343301)
EC50
>10000±n/a nM
Citation
 Zhou, HTopiol, SWGrenon, MJimenez, HNUberti, MASmith, DGBrodbeck, RMChandrasena, GPedersen, HMadsen, JCDoller, DLi, G Discovery and structure-activity relationship of 1,3-cyclohexyl amide derivatives as novel mGluR5 negative allosteric modulators. Bioorg Med Chem Lett 23:1398-406 (2013)  
Target
Name:
Metabotropic glutamate receptor 1
Synonyms:
GRM1_RAT Grm1 Metabotropic glutamate receptor Mglur1 metabotropic glutamate 1/5-D metabotropic glutamate receptor 1 isoform alpha precursor
Type:
Enzyme Catalytic Domain
Mol. Mass.:
133240.47
Organism:
RAT
Description:
metabotropic glutamate 1/2 0 RAT::P23385
Residue:
1199
  
Inhibitor
Name:
BDBM50429412
Synonyms:
CHEMBL2338582
Type:
Small organic molecule
Emp. Form.:
C20H20ClN3O2
Mol. Mass.:
369.845
SMILES:
Clc1cccc(c1)C1=NC[C@]2(CCC[C@@H](C2)NC(=O)c2ccccn2)O1
: