Target
Vascular endothelial growth factor receptor 2
Ligand
BDBM50429493
Substrate
Meas. Tech.
ChEMBL_943682 (CHEMBL2344826)
IC50
74700±n/a nM
Citation
 Yang, LLLi, GBMa, SZou, CZhou, SSun, QZCheng, CChen, XWang, LJFeng, SLi, LLYang, SY Structure-activity relationship studies of pyrazolo[3,4-d]pyrimidine derivatives leading to the discovery of a novel multikinase inhibitor that potently inhibits FLT3 and VEGFR2 and evaluation of its activity against acute myeloid leukemia in vitro and in vivo. J Med Chem 56:1641-55 (2013)  
Target
Name:
Vascular endothelial growth factor receptor 2
Synonyms:
FLK-1b Kinase insert domain receptor Protein-tyrosine kinase receptor flk-1b VEGFR-2 homolog B Vascular endothelial growth factor receptor 2 homolog B kdr si:ch211-254j6.1
Type:
PROTEIN
Mol. Mass.:
153046.15
Organism:
Danio rerio
Description:
ChEMBL_943682
Residue:
1357
  
Inhibitor
Name:
BDBM50429493
Synonyms:
CHEMBL2332858
Type:
Small organic molecule
Emp. Form.:
C18H12BrN5O2
Mol. Mass.:
410.224
SMILES:
Brc1ccc(cc1)C(=O)Nc1ccc(Oc2ncnc3n[nH]cc23)cc1
: