Target
Histone deacetylase 6
Ligand
BDBM50429525
Substrate
Meas. Tech.
ChEMBL_944720 (CHEMBL2340966)
Temperature
298.15±n/a K
IC50
30±n/a nM
Comments
extracted
Citation
 Wagner, FFOlson, DEGale, JPKaya, TWeïwer, MAidoud, NThomas, MDavoine, ELLemercier, BCZhang, YLHolson, EB Potent and selective inhibition of histone deacetylase 6 (HDAC6) does not require a surface-binding motif. J Med Chem 56:1772-6 (2013)  
Target
Name:
Histone deacetylase 6
Synonyms:
Cereblon/Histone deacetylase 6 HDAC6 Histone deacetylase 6 (HDAC6) KIAA0901 | ORF Names:JM21
Type:
Chromatin regulator; hydrolase; repressor
Mol. Mass.:
131381.51
Organism:
Homo sapiens (Human)
Description:
Q9UBN7
Residue:
1215
  
Inhibitor
Name:
BDBM50429525
Synonyms:
CHEMBL2333346
Type:
Small organic molecule
Emp. Form.:
C6H9NO2
Mol. Mass.:
127.1412
SMILES:
ONC(=O)C1=CCCC1
: