Target
Mitogen-activated protein kinase kinase kinase 14
Ligand
BDBM50429613
Substrate
Meas. Tech.
ChEMBL_945747 (CHEMBL2346384)
IC50
600±n/a nM
Citation
 Li, KMcGee, LRFisher, BSudom, ALiu, JRubenstein, SMAnwer, MKCushing, TDShin, YAyres, MLee, FEksterowicz, JFaulder, PWaszkowycz, BPlotnikova, OFarrelly, EXiao, SHChen, GWang, Z Inhibiting NF-¿B-inducing kinase (NIK): discovery, structure-based design, synthesis, structure-activity relationship, and co-crystal structures. Bioorg Med Chem Lett 23:1238-44 (2013)  
Target
Name:
Mitogen-activated protein kinase kinase kinase 14
Synonyms:
HsNIK MAP3K14 NF-kappa-beta-inducing kinase (NF-kB) Serine/threonine-protein kinase NIK
Type:
Protein
Mol. Mass.:
104059.50
Organism:
Homo sapiens (Human)
Description:
Q99558
Residue:
947
  
Inhibitor
Name:
BDBM50429613
Synonyms:
CHEMBL2334590
Type:
Small organic molecule
Emp. Form.:
C12H10ClN5
Mol. Mass.:
259.694
SMILES:
Cc1nc2ccc(Cl)cn2c1-c1ccnc(N)n1
: