Target
Protein S100-B
Ligand
BDBM50429684
Substrate
Meas. Tech.
ChEMBL_947124 (CHEMBL2341094)
IC50
36300±n/a nM
Citation
 Yoshimura, CMiyafusa, TTsumoto, K Identification of small-molecule inhibitors of the human S100B-p53 interaction and evaluation of their activity in human melanoma cells. Bioorg Med Chem 21:1109-15 (2013)  
Target
Name:
Protein S100-B
Synonyms:
S-100 protein beta chain S100B_HUMAN
Type:
PROTEIN
Mol. Mass.:
10701.34
Organism:
Homo sapiens (Human)
Description:
ChEMBL_947124
Residue:
92
  
Inhibitor
Name:
BDBM50429684
Synonyms:
4-(4-Methoxybenzylideneamino)Phenol | CHEMBL67238
Type:
Small organic molecule
Emp. Form.:
C14H13NO2
Mol. Mass.:
227.2585
SMILES:
COc1ccc(\C=N\c2ccc(O)cc2)cc1
: