Target
72 kDa type IV collagenase
Ligand
BDBM4375
Substrate
Meas. Tech.
ChEMBL_948151 (CHEMBL2338837)
IC50
24±n/a nM
Citation
 Shi, ZHLi, NGShi, QPTang, HTang, YPLi, WYin, LYang, JPDuan, JA Synthesis and structure-activity relationship analysis of caffeic acid amides as selective matrix metalloproteinase inhibitors. Bioorg Med Chem Lett 23:1206-11 (2013)  
Target
Name:
72 kDa type IV collagenase
Synonyms:
72 kDa gelatinase CLG4A Gelatinase A (MMP-2) MMP2_HUMAN Matrix metalloproteinase-2 (MMP 2) Matrix metalloproteinases 2 (MMP-2) | TBE-1
Type:
Enzyme
Mol. Mass.:
73870.36
Organism:
Homo sapiens (Human)
Description:
P08253
Residue:
660
  
Inhibitor
Name:
BDBM4375
Synonyms:
(2E)-3-(3,4-dihydroxyphenyl)prop-2-enoic acid 3,4-Dihydroxycinnamate, XVII Caffeic acid cid_689043
Type:
Small organic molecule
Emp. Form.:
C9H8O4
Mol. Mass.:
180.1574
SMILES:
OC(=O)\C=C\c1ccc(O)c(O)c1
: