Target
Matrix metalloproteinase-14
Ligand
BDBM50175548
Substrate
Meas. Tech.
ChEMBL_948651 (CHEMBL2345601)
IC50
4.0±n/a nM
Citation
 Nuti, ESantamaria, SCasalini, FYamamoto, KMarinelli, LLa Pietra, VNovellino, EOrlandini, ENencetti, SMarini, AMSalerno, STaliani, SDa Settimo, FNagase, HRossello, A Arylsulfonamide inhibitors of aggrecanases as potential therapeutic agents for osteoarthritis: synthesis and biological evaluation. Eur J Med Chem 62:379-94 (2013)  
Target
Name:
Matrix metalloproteinase-14
Synonyms:
MMP-14 MMP14 MT-MMP 1 MT1MMP Matrix Metalloproteinase-14 (MMP-14) Matrix metalloproteinase-14 Membrane-type matrix metalloproteinase 1 | Membrane-type-1 matrix metalloproteinase
Type:
Protein
Mol. Mass.:
65900.19
Organism:
Homo sapiens (Human)
Description:
P50281
Residue:
582
  
Inhibitor
Name:
BDBM50175548
Synonyms:
CHEMBL198778 | N-Hydroxy-2-(4-phenoxy-benzenesulfonylamino)-acetamide
Type:
Small organic molecule
Emp. Form.:
C14H14N2O5S
Mol. Mass.:
322.336
SMILES:
ONC(=O)CNS(=O)(=O)c1ccc(Oc2ccccc2)cc1
: