Target
Protein kinase C beta type
Ligand
BDBM50429867
Substrate
Meas. Tech.
ChEMBL_944226 (CHEMBL2343433)
IC50
>10000±n/a nM
Citation
 Takeuchi, CSKim, BGBlazey, CMMa, SJohnson, HWAnand, NKArcalas, ABaik, TGBuhr, CACannoy, JEpshteyn, SJoshi, ALara, KLee, MSWang, LLeahy, JWNuss, JMAay, NAoyama, RFoster, PLee, JLehoux, IMunagala, NPlonowski, ARajan, SWoolfrey, JYamaguchi, KLamb, PMiller, N Discovery of a novel class of highly potent, selective, ATP-competitive, and orally bioavailable inhibitors of the mammalian target of rapamycin (mTOR). J Med Chem 56:2218-34 (2013)  
Target
Name:
Protein kinase C beta type
Synonyms:
KPCB_HUMAN PKC beta PKCB PRKCB1 Protein kinase C beta type | Protein kinase C beta type II (PRKCB2)
Type:
Enzyme
Mol. Mass.:
76873.67
Organism:
Homo sapiens (Human)
Description:
The recombinant human PKC enzymes were produced using a baculovirus expression system in SF9 cells
Residue:
671
  
Inhibitor
Name:
BDBM50429867
Synonyms:
CHEMBL2333365
Type:
Small organic molecule
Emp. Form.:
C23H22FN3O4S
Mol. Mass.:
455.502
SMILES:
Cc1c(F)c(ccc1C(=O)N1CCOc2ccc(cc2C1)-c1ccc(N)nc1)S(C)(=O)=O
: