Target
Serine/threonine-protein kinase ULK2
Ligand
BDBM50429867
Substrate
Meas. Tech.
ChEMBL_943748 (CHEMBL2345761)
IC50
>10000±n/a nM
Citation
 Takeuchi, CSKim, BGBlazey, CMMa, SJohnson, HWAnand, NKArcalas, ABaik, TGBuhr, CACannoy, JEpshteyn, SJoshi, ALara, KLee, MSWang, LLeahy, JWNuss, JMAay, NAoyama, RFoster, PLee, JLehoux, IMunagala, NPlonowski, ARajan, SWoolfrey, JYamaguchi, KLamb, PMiller, N Discovery of a novel class of highly potent, selective, ATP-competitive, and orally bioavailable inhibitors of the mammalian target of rapamycin (mTOR). J Med Chem 56:2218-34 (2013)  
Target
Name:
Serine/threonine-protein kinase ULK2
Synonyms:
KIAA0623 ULK2_HUMAN | Unc-51-like kinase 2
Type:
PROTEIN
Mol. Mass.:
112726.26
Organism:
Homo sapiens (Human)
Description:
ChEMBL_1510276
Residue:
1036
  
Inhibitor
Name:
BDBM50429867
Synonyms:
CHEMBL2333365
Type:
Small organic molecule
Emp. Form.:
C23H22FN3O4S
Mol. Mass.:
455.502
SMILES:
Cc1c(F)c(ccc1C(=O)N1CCOc2ccc(cc2C1)-c1ccc(N)nc1)S(C)(=O)=O
: