Target
Carbonic anhydrase 2
Ligand
BDBM50406452
Substrate
Meas. Tech.
ChEMBL_945275 (CHEMBL2340473)
pH
7±n/a
Kd
330±n/a nM
Comments
extracted
Citation
 Dudutiene, VZubriene, ASmirnov, AGylyte, JTimm, DManakova, EGražulis, SMatulis, D 4-Substituted-2,3,5,6-tetrafluorobenzenesulfonamides as inhibitors of carbonic anhydrases I, II, VII, XII, and XIII. Bioorg Med Chem 21:2093-106 (2013)  
Target
Name:
Carbonic anhydrase 2
Synonyms:
CA-II CAC Carbonate dehydratase II Carbonic anhydrase 2 (CA-II) Carbonic anhydrase C Carbonic anhydrase II (CA-II) Carbonic anhydrase II (hCA II) | Carbonic anhydrase isoenzyme II (hCA II)
Type:
Enzyme
Mol. Mass.:
29250.71
Organism:
Homo sapiens (Human)
Description:
P00918
Residue:
260
  
Inhibitor
Name:
BDBM50406452
Synonyms:
CHEMBL106848
Type:
Small organic molecule
Emp. Form.:
C8H11NO3S2
Mol. Mass.:
233.308
SMILES:
NS(=O)(=O)c1ccc(SCCO)cc1
: