Target
Carbonic anhydrase 12
Ligand
BDBM50429909
Substrate
Meas. Tech.
ChEMBL_945278 (CHEMBL2340476)
pH
7±n/a
Kd
100±n/a nM
Comments
extracted
Citation
 Dudutiene, VZubriene, ASmirnov, AGylyte, JTimm, DManakova, EGražulis, SMatulis, D 4-Substituted-2,3,5,6-tetrafluorobenzenesulfonamides as inhibitors of carbonic anhydrases I, II, VII, XII, and XIII. Bioorg Med Chem 21:2093-106 (2013)  
Target
Name:
Carbonic anhydrase 12
Synonyms:
CA-XII CAH12_HUMAN Carbonic anhydrase Carbonic anhydrase XII Carbonic anhydrase XII (CAXII) | Tumor antigen HOM-RCC-3.1.3
Type:
Enzyme
Mol. Mass.:
39456.00
Organism:
Homo sapiens (Human)
Description:
Catalytic domain of human cloned isozyme was used in the assay
Residue:
354
  
Inhibitor
Name:
BDBM50429909
Synonyms:
CHEMBL2333409
Type:
Small organic molecule
Emp. Form.:
C16H15F4NO2S2
Mol. Mass.:
393.419
SMILES:
Cc1cc(C)c(CSc2c(F)c(F)c(c(F)c2F)S(N)(=O)=O)c(C)c1
: