Target
Carbonic anhydrase 7
Ligand
BDBM50429900
Substrate
Meas. Tech.
ChEMBL_945279 (CHEMBL2340477)
pH
7±n/a
Kd
7.1±n/a nM
Comments
extracted
Citation
 Dudutiene, VZubriene, ASmirnov, AGylyte, JTimm, DManakova, EGražulis, SMatulis, D 4-Substituted-2,3,5,6-tetrafluorobenzenesulfonamides as inhibitors of carbonic anhydrases I, II, VII, XII, and XIII. Bioorg Med Chem 21:2093-106 (2013)  
Target
Name:
Carbonic anhydrase 7
Synonyms:
CA-VII CAH7_HUMAN Carbonic anhydrase Carbonic anhydrase VII (CA VII)
Type:
Enzyme
Mol. Mass.:
29664.11
Organism:
Homo sapiens (Human)
Description:
Human cloned isozyme.
Residue:
264
  
Inhibitor
Name:
BDBM50429900
Synonyms:
CHEMBL2333417
Type:
Small organic molecule
Emp. Form.:
C8H7F4NO5S2
Mol. Mass.:
337.268
SMILES:
NS(=O)(=O)c1c(F)c(F)c(c(F)c1F)S(=O)(=O)CCO
: