Target
Carbonic anhydrase 2
Ligand
BDBM50429916
Substrate
Meas. Tech.
ChEMBL_945280 (CHEMBL2340478)
pH
7±n/a
Kd
2.5±n/a nM
Comments
extracted
Citation
 Dudutiene, VZubriene, ASmirnov, AGylyte, JTimm, DManakova, EGražulis, SMatulis, D 4-Substituted-2,3,5,6-tetrafluorobenzenesulfonamides as inhibitors of carbonic anhydrases I, II, VII, XII, and XIII. Bioorg Med Chem 21:2093-106 (2013)  
Target
Name:
Carbonic anhydrase 2
Synonyms:
CA-II CAC Carbonate dehydratase II Carbonic anhydrase 2 (CA-II) Carbonic anhydrase C Carbonic anhydrase II (CA-II) Carbonic anhydrase II (hCA II) | Carbonic anhydrase isoenzyme II (hCA II)
Type:
Enzyme
Mol. Mass.:
29250.71
Organism:
Homo sapiens (Human)
Description:
P00918
Residue:
260
  
Inhibitor
Name:
BDBM50429916
Synonyms:
CHEMBL2333402
Type:
Small organic molecule
Emp. Form.:
C12H7F4NO3S
Mol. Mass.:
321.247
SMILES:
NS(=O)(=O)c1c(F)c(F)c(Oc2ccccc2)c(F)c1F
: