Target
Carbonic anhydrase 1
Ligand
BDBM50429921
Substrate
Meas. Tech.
ChEMBL_945281 (CHEMBL2340479)
pH
7±n/a
Kd
0.200000±n/a nM
Comments
extracted
Citation
 Dudutiene, VZubriene, ASmirnov, AGylyte, JTimm, DManakova, EGražulis, SMatulis, D 4-Substituted-2,3,5,6-tetrafluorobenzenesulfonamides as inhibitors of carbonic anhydrases I, II, VII, XII, and XIII. Bioorg Med Chem 21:2093-106 (2013)  
Target
Name:
Carbonic anhydrase 1
Synonyms:
CA-I CAB Carbonate dehydratase I Carbonic anhydrase 1 (CA I) Carbonic anhydrase 1 (Recombinant CA I) Carbonic anhydrase B Carbonic anhydrase I (CA I) Carbonic anhydrase I (CAI) Carbonic anhydrase isoenzyme I (hCA I) | hCA
Type:
Enzyme
Mol. Mass.:
28873.37
Organism:
Homo sapiens (Human)
Description:
P00915
Residue:
261
  
Inhibitor
Name:
BDBM50429921
Synonyms:
CHEMBL2333419
Type:
Small organic molecule
Emp. Form.:
C8H5F4NO4S2
Mol. Mass.:
319.253
SMILES:
NS(=O)(=O)c1c(F)c(F)c(SCC(O)=O)c(F)c1F
: