Target
C-C chemokine receptor type 1
Ligand
BDBM50430281
Substrate
Meas. Tech.
ChEMBL_943371 (CHEMBL2340879)
IC50
1.4±n/a nM
Citation
 Hossain, NIvanova, SBergare, JEriksson, T Spirocyclic compounds, potent CCR1 antagonists. Bioorg Med Chem Lett 23:1883-6 (2013)  
Target
Name:
C-C chemokine receptor type 1
Synonyms:
C-C CKR-1 CC-CKR-1 CCR1 CD_antigen=CD191 CMKR1 LD78 receptor Macrophage inflammatory protein 1-alpha receptor SCYAR1
Type:
Enzyme
Mol. Mass.:
41180.69
Organism:
Homo sapiens (Human)
Description:
P32246
Residue:
355
  
Inhibitor
Name:
BDBM50430281
Synonyms:
CHEMBL2332941
Type:
Small organic molecule
Emp. Form.:
C23H28FN3O4
Mol. Mass.:
429.4845
SMILES:
CC(=O)Nc1ccc(O)cc1OC[C@@H](N)CN1CCC2(Cc3cc(F)ccc3O2)CC1
: