Target
Carbonic anhydrase 9
Ligand
BDBM50430551
Substrate
Meas. Tech.
ChEMBL_946751 (CHEMBL2344100)
IC50
0.480000±n/a nM
Citation
 Gao, RLiao, SZhang, CZhu, WWang, LHuang, JZhao, ZLi, HQian, XXu, Y Optimization of heterocyclic substituted benzenesulfonamides as novel carbonic anhydrase IX inhibitors and their structure activity relationship. Eur J Med Chem 62:597-604 (2013)  
Target
Name:
Carbonic anhydrase 9
Synonyms:
CA-IX CAH9_HUMAN Carbonic anhydrase 9 (CA IX) Carbonic anhydrase 9 precursor Carbonic anhydrase IX (CAIX) Carbonic anhydrases; II & IX MN RCC-associated antigen G250
Type:
Enzyme
Mol. Mass.:
49669.03
Organism:
Homo sapiens (Human)
Description:
Catalytic domain of human cloned isozyme was used in the assay
Residue:
459
  
Inhibitor
Name:
BDBM50430551
Synonyms:
CHEMBL2336905
Type:
Small organic molecule
Emp. Form.:
C21H19N5O4S2
Mol. Mass.:
469.537
SMILES:
Cc1ccc(cc1S(N)(=O)=O)-c1nnc(Nc2ccc(cc2)S(N)(=O)=O)c2ccccc12
: