Target
Mu-type opioid receptor
Ligand
BDBM50430627
Substrate
Meas. Tech.
ChEMBL_948260 (CHEMBL2340178)
Ki
2.7±n/a nM
Citation
 Greedy, BMBradbury, FThomas, MPGrivas, KCami-Kobeci, GArchambeau, ABosse, KClark, MJAceto, MLewis, JWTraynor, JRHusbands, SM Orvinols with mixed kappa/mu opioid receptor agonist activity. J Med Chem 56:3207-16 (2013)  
Target
Name:
Mu-type opioid receptor
Synonyms:
M-OR-1 Mu opioid receptor OPIATE Mu OPRM_CAVPO
Type:
Enzyme Catalytic Domain
Mol. Mass.:
11165.58
Organism:
GUINEA PIG
Description:
P97266
Residue:
98
  
Inhibitor
Name:
BDBM50430627
Synonyms:
CHEMBL2338736
Type:
Small organic molecule
Emp. Form.:
C30H43NO4
Mol. Mass.:
481.6667
SMILES:
CCCCC[C@](C)(O)[C@H]1C[C@]23CC[C@]1(OC)[C@@H]1Oc4c5c(C[C@H]2N(CC2CC2)CC[C@@]315)ccc4O
: