Target
Aminopeptidase N
Ligand
BDBM50430634
Substrate
Meas. Tech.
ChEMBL_942091 (CHEMBL2340789)
IC50
180±n/a nM
Citation
 Ma, CJin, KCao, JZhang, LLi, XXu, W Novel leucine ureido derivatives as inhibitors of aminopeptidase N (APN). Bioorg Med Chem 21:1621-7 (2013)  
Target
Name:
Aminopeptidase N
Synonyms:
AMPN_PIG AP-M Alanyl aminopeptidase Aminopeptidase N (APN) Microsomal aminopeptidase pAPN
Type:
Protein
Mol. Mass.:
108810.25
Organism:
Sus scrofa (Pig)
Description:
P15145
Residue:
963
  
Inhibitor
Name:
BDBM50430634
Synonyms:
CHEMBL2332526
Type:
Small organic molecule
Emp. Form.:
C14H21N3O3
Mol. Mass.:
279.3348
SMILES:
CC(C)C[C@H](NC(=O)Nc1ccccc1C)C(=O)NO
: