Target
Nitric oxide synthase, brain
Ligand
BDBM50141082
Substrate
Meas. Tech.
ChEMBL_942957 (CHEMBL2343335)
IC50
70±n/a nM
Citation
 Trippier, PCJansen Labby, KHawker, DDMataka, JJSilverman, RB Target- and mechanism-based therapeutics for neurodegenerative diseases: strength in numbers. J Med Chem 56:3121-47 (2013)  
Target
Name:
Nitric oxide synthase, brain
Synonyms:
Constitutive NOS NC-NOS NOS type I nNOS NOS1_HUMAN Neuronal nitric oxide synthase Nitric oxide synthase, neuronal (nNOS) bNOS | nNOS
Type:
Homodimer
Mol. Mass.:
160985.98
Organism:
Homo sapiens (Human)
Description:
P29475
Residue:
1434
  
Inhibitor
Name:
BDBM50141082
Synonyms:
6-[4-(2-Dimethylamino-ethoxy)-5,6,7,8-tetrahydro-naphthalen-1-yl]-pyridin-2-ylamine | CHEMBL43815
Type:
Small organic molecule
Emp. Form.:
C19H25N3O
Mol. Mass.:
311.4213
SMILES:
CN(C)CCOc1ccc(-c2cccc(N)n2)c2CCCCc12
: